�N,�N,��,�J����,�J����,�J����,�J����,�J����,�J����,�J����,�J����,�J����,�J����,�J����,�J����,�J����,�J����,�J����,�J����,�J����,�J����,�J����,�J����,�J����,�J����,�J����,�J����,�J����,�J����,���l
����31,2019,4,1,2,3,4,5,6,7,13,14,20,21,26,27,28,29,30,,,,,,,,,,,���ԏꉜ�����ܑ������ɂ��ẮA���ʎg�p�ł��܂���B
�ߘa1,2019,5,1,2,3,4,5,6,7,11,12,18,19,25,26,,,,,,,,,,,,,,���ԏꉜ�����ܑ������ɂ��ẮA���ʎg�p�ł��܂���B
�ߘa1,2019,6,1,2,8,9,15,16,22,23,29,30,,,,,,,,,,,,,,,,,���ԏꉜ�����ܑ������ɂ��ẮA���ʎg�p�ł��܂���B
�ߘa1,2019,7,6,7,12,13,14,15,16,20,21,27,28,29,30,31,,,,,,,,,,,,,���ԏꉜ�����ܑ������ɂ��ẮA���ʎg�p�ł��܂���B
�ߘa1,2019,8,1,2,3,4,5,6,7,8,9,10,11,12,13,14,15,16,17,18,19,20,21,22,23,24,25,26,���ԏꉜ�����ܑ������ɂ��ẮA���ʎg�p�ł��܂���B
�ߘa1,2019,9,7,8,13,14,15,16,17,20,21,22,23,24,28,29,,,,,,,,,,,,,���ԏꉜ�����ܑ������ɂ��ẮA���ʎg�p�ł��܂���B
�ߘa1,2019,10,4,5,6,7,11,12,13,14,15,19,20,21,22,23,26,27,,,,,,,,,,,���ԏꉜ�����ܑ������ɂ��ẮA���ʎg�p�ł��܂���B
�ߘa1,2019,11,1,2,3,4,5,9,10,16,17,22,23,24,30,,,,,,,,,,,,,,���ԏꉜ�����ܑ������ɂ��ẮA���ʎg�p�ł��܂���B
�ߘa1,2019,12,1,7,8,14,15,20,21,22,23,24,25,26,27,28,29,30,31,,,,,,,,,,���ԏꉜ�����ܑ������ɂ��ẮA���ʎg�p�ł��܂���B
�ߘa2,2020,1,1,2,3,4,5,6,10,11,12,13,14,18,19,25,26,,,,,,,,,,,,���ԏꉜ�����ܑ������ɂ��ẮA���ʎg�p�ł��܂���B
�ߘa2,2020,2,1,2,7,8,9,10,11,12,15,16,22,23,,,,,,,,,,,,,,,���ԏꉜ�����ܑ������ɂ��ẮA���ʎg�p�ł��܂���B
�ߘa2,2020,3,1,2,8,9,15,16,17,18,19,20,21,22,23,24,25,26,27,28,29,30,31,,,,,,���ԏꉜ�����ܑ������ɂ��ẮA���ʎg�p�ł��܂���B
